Reaction Details
TargetCarbonic anhydrase 2
LigandBDBM26194
Substrate/Competitorn/a
Meas. Tech.ChEMBL_613329 (CHEMBL1074266)
Ki 870±n/a nM
Citation Innocenti, ABeyza Oztürk Sarikaya, SGülçin, ISupuran, CT Carbonic anhydrase inhibitors. Inhibition of mammalian isoforms I-XIV with a series of natural product polyphenols and phenolic acids. Bioorg Med Chem18:2159-64 (2010) 
 
Carbonic anhydrase 2
Name:Carbonic anhydrase 2
Type:Enzyme
Mol. Mass.:29250.71
Organism:Homo sapiens (Human)
Description:P00918
Residue:260
BDBM26194
NameBDBM26194
Synonyms:4-Hydroxybenzoate, III CHEMBL441343 phenol derivative, 8
TypeSmall organic molecule
Emp. Form.C7H6O3
Mol. Mass.138.1207
SMILESOC(=O)c1ccc(O)cc1