Reaction Details
TargetAdenosine receptor A1
LigandBDBM25400
Substrate/Competitorn/a
Meas. Tech.ChEMBL_613342 (CHEMBL1074279)
Ki 0.800000±n/a nM
Citation Scheiff, ABYerande, SGEl-Tayeb, ALi, WInamdar, GSVasu, KKSudarsanam, VMüller, CE 2-Amino-5-benzoyl-4-phenylthiazoles: Development of potent and selective adenosine A1 receptor antagonists. Bioorg Med Chem18:2195-203 (2010) 
 
Adenosine receptor A1
Name:Adenosine receptor A1
Type:Protein
Mol. Mass.:36704.13
Organism:Rattus norvegicus (rat)
Description:n/a
Residue:326
BDBM25400
NameBDBM25400
Synonyms:(2R,3R,4S,5R)-2-[6-(cyclopentylamino)-9H-purin-9-yl]-5-(hydroxymethyl)oxolane-3,4-diol CPA N6-cyclopentyladenosine (CPA) | cid_657378
TypeSmall organic molecule
Emp. Form.C15H21N5O4
Mol. Mass.335.3583
SMILESOC[C@H]1O[C@H]([C@H](O)[C@@H]1O)n1cnc2c(NC3CCCC3)ncnc12