Reaction Details
TargetAdenosine receptor A2a
LigandBDBM50308508
Substrate/Competitorn/a
Meas. Tech.ChEMBL_613367 (CHEMBL1068174)
Ki 3750±n/a nM
Citation Scheiff, ABYerande, SGEl-Tayeb, ALi, WInamdar, GSVasu, KKSudarsanam, VMüller, CE 2-Amino-5-benzoyl-4-phenylthiazoles: Development of potent and selective adenosine A1 receptor antagonists. Bioorg Med Chem18:2195-203 (2010) 
 
Adenosine receptor A2a
Name:Adenosine receptor A2a
Type:Enzyme Catalytic Domain
Mol. Mass.:44955.08
Organism:GUINEA PIG
Description:ADENOSINE A2 0 GUINEA PIG::P46616
Residue:409
BDBM50308508
NameBDBM50308508
Synonyms:CHEMBL589549 | N-((1R,2S,4S)-bicyclo[2.2.1]heptan-2-yl)-9-methyl-9H-purin-6-amine
TypeSmall organic molecule
Emp. Form.C13H17N5
Mol. Mass.243.3076
SMILESCn1cnc2c(N[C@H]3C[C@H]4CC[C@@H]3C4)ncnc12