Reaction Details
TargetAdenosine receptor A2a
LigandBDBM21173
Substrate/Competitorn/a
Meas. Tech.ChEMBL_613345 (CHEMBL1074282)
Ki 157±n/a nM
Citation Scheiff, ABYerande, SGEl-Tayeb, ALi, WInamdar, GSVasu, KKSudarsanam, VMüller, CE 2-Amino-5-benzoyl-4-phenylthiazoles: Development of potent and selective adenosine A1 receptor antagonists. Bioorg Med Chem18:2195-203 (2010) 
 
Adenosine receptor A2a
Name:Adenosine receptor A2a
Type:G Protein-Coupled Receptor (GPCR)
Mol. Mass.:45015.65
Organism:Rattus norvegicus (rat)
Description:Rat A2A receptors expressed in CHO cells.
Residue:410
BDBM21173
NameBDBM21173
Synonyms:1,3-dipropyl-8-cyclopentylxanthine CHEMBL183 PD116948 | [3H]DPCPX
Typeradiolabeled ligand
Emp. Form.C16H24N4O2
Mol. Mass.304.3874
SMILESCCCn1c2nc([nH]c2c(=O)n(CCC)c1=O)C1CCCC1