Reaction Details
TargetAdenosine receptor A1
LigandBDBM50308494
Substrate/Competitorn/a
Meas. Tech.ChEMBL_613342 (CHEMBL1074279)
Ki 9.5±n/a nM
Citation Scheiff, ABYerande, SGEl-Tayeb, ALi, WInamdar, GSVasu, KKSudarsanam, VMüller, CE 2-Amino-5-benzoyl-4-phenylthiazoles: Development of potent and selective adenosine A1 receptor antagonists. Bioorg Med Chem18:2195-203 (2010) 
 
Adenosine receptor A1
Name:Adenosine receptor A1
Type:Protein
Mol. Mass.:36704.13
Organism:Rattus norvegicus (rat)
Description:n/a
Residue:326
BDBM50308494
NameBDBM50308494
Synonyms:CHEMBL600232 | N-(5-Benzoyl-4-phenylthiazol-2-yl)benzamide
TypeSmall organic molecule
Emp. Form.C23H16N2O2S
Mol. Mass.384.45
SMILESO=C(Nc1nc(c(s1)C(=O)c1ccccc1)-c1ccccc1)c1ccccc1