Reaction Details
TargetCystine/glutamate transporter
LigandBDBM50378668
Substrate/Competitorn/a
Meas. Tech.ChEMBL_607278 (CHEMBL1072820)
Ki 113000±n/a nM
Citation Patel, SARajale, TO'Brien, EBurkhart, DJNelson, JKTwamley, BBlumenfeld, ASzabon-Watola, MIGerdes, JMBridges, RJNatale, NR Isoxazole analogues bind the system xc- transporter: structure-activity relationship and pharmacophore model. Bioorg Med Chem18:202-13 (2010) 
 
Cystine/glutamate transporter
Name:Cystine/glutamate transporter
Type:PROTEIN
Mol. Mass.:55437.48
Organism:Homo sapiens (Human)
Description:ChEMBL_772170
Residue:501
BDBM50378668
NameBDBM50378668
Synonyms:CHEMBL606915
TypeSmall organic molecule
Emp. Form.C24H19N5O7
Mol. Mass.489.437
SMILESCC(N=Nc1ccc(cc1[N+]([O-])=O)[N+]([O-])=O)c1c(CCc2ccc3ccccc3c2)onc1C(O)=O