Reaction Details
TargetCystine/glutamate transporter
LigandBDBM50378670
Substrate/Competitorn/a
Meas. Tech.ChEMBL_607278 (CHEMBL1072820)
Ki 52000±n/a nM
Citation Patel, SARajale, TO'Brien, EBurkhart, DJNelson, JKTwamley, BBlumenfeld, ASzabon-Watola, MIGerdes, JMBridges, RJNatale, NR Isoxazole analogues bind the system xc- transporter: structure-activity relationship and pharmacophore model. Bioorg Med Chem18:202-13 (2010) 
 
Cystine/glutamate transporter
Name:Cystine/glutamate transporter
Type:PROTEIN
Mol. Mass.:55437.48
Organism:Homo sapiens (Human)
Description:ChEMBL_772170
Residue:501
BDBM50378670
NameBDBM50378670
Synonyms:CHEMBL600474
TypeSmall organic molecule
Emp. Form.C19H18N2O5
Mol. Mass.354.3566
SMILESN[C@@H](Cc1c(CCc2ccc3ccccc3c2)onc1C(O)=O)C(O)=O