Reaction Details
TargetCannabinoid receptor 2
LigandBDBM50309054
Substrate/Competitorn/a
Meas. Tech.ChEMBL_612941 (CHEMBL1070893)
Ki>1846±n/a nM
Citation Scott, JDLi, SWWang, HXia, YJayne, CLMiller, MWDuffy, RABoykow, GCKowalski, TJSpar, BDStamford, AWChackalamannil, SLachowicz, JEGreenlee, WJ Diaryl piperidines as CB1 receptor antagonists. Bioorg Med Chem Lett20:1278-83 (2010) 
 
Cannabinoid receptor 2
Name:Cannabinoid receptor 2
Type:G Protein-Coupled Receptor (GPCR)
Mol. Mass.:39690.94
Organism:Homo sapiens (Human)
Description:P34972
Residue:360
BDBM50309054
NameBDBM50309054
Synonyms:CHEMBL592628 | trans-1-(4-chlorophenyl)-2-(2,4-dichlorophenyl)-5-(3,4-difluorobenzyl)piperidine
TypeSmall organic molecule
Emp. Form.C24H20Cl3F2N
Mol. Mass.466.778
SMILESFc1ccc(C[C@H]2CC[C@@H](N(C2)c2ccc(Cl)cc2)c2ccc(Cl)cc2Cl)cc1F