Reaction Details
TargetCannabinoid receptor 1
LigandBDBM50309028
Substrate/Competitorn/a
Meas. Tech.ChEMBL_612940 (CHEMBL1070892)
Ki 16±n/a nM
Citation Scott, JDLi, SWWang, HXia, YJayne, CLMiller, MWDuffy, RABoykow, GCKowalski, TJSpar, BDStamford, AWChackalamannil, SLachowicz, JEGreenlee, WJ Diaryl piperidines as CB1 receptor antagonists. Bioorg Med Chem Lett20:1278-83 (2010) 
 
Cannabinoid receptor 1
Name:Cannabinoid receptor 1
Type:G Protein-Coupled Receptor (GPCR)
Mol. Mass.:52868.96
Organism:Homo sapiens (Human)
Description:P21554
Residue:472
BDBM50309028
NameBDBM50309028
Synonyms:(2S,5R)-1-(4-chlorophenyl)-2-(2,4-dichlorophenyl)-5-(piperidin-1-ylsulfonyl)piperidine | CHEMBL589093
TypeSmall organic molecule
Emp. Form.C22H25Cl3N2O2S
Mol. Mass.487.87
SMILESClc1ccc(cc1)N1C[C@@H](CC[C@H]1c1ccc(Cl)cc1Cl)S(=O)(=O)N1CCCCC1