Reaction Details
TargetCannabinoid receptor 1
LigandBDBM50309031
Substrate/Competitorn/a
Meas. Tech.ChEMBL_612940 (CHEMBL1070892)
Ki 33±n/a nM
Citation Scott, JDLi, SWWang, HXia, YJayne, CLMiller, MWDuffy, RABoykow, GCKowalski, TJSpar, BDStamford, AWChackalamannil, SLachowicz, JEGreenlee, WJ Diaryl piperidines as CB1 receptor antagonists. Bioorg Med Chem Lett20:1278-83 (2010) 
 
Cannabinoid receptor 1
Name:Cannabinoid receptor 1
Type:G Protein-Coupled Receptor (GPCR)
Mol. Mass.:52868.96
Organism:Homo sapiens (Human)
Description:P21554
Residue:472
BDBM50309031
NameBDBM50309031
Synonyms:(3R,6S)-1-(4-chlorophenyl)-N-cyclobutyl-6-(2,4-dichlorophenyl)piperidine-3-carboxamide | CHEMBL609266
TypeSmall organic molecule
Emp. Form.C22H23Cl3N2O
Mol. Mass.437.79
SMILESClc1ccc(cc1)N1C[C@@H](CC[C@H]1c1ccc(Cl)cc1Cl)C(=O)NC1CCC1