Reaction Details
TargetCannabinoid receptor 1
LigandBDBM50309038
Substrate/Competitorn/a
Meas. Tech.ChEMBL_612940 (CHEMBL1070892)
Ki 44±n/a nM
Citation Scott, JDLi, SWWang, HXia, YJayne, CLMiller, MWDuffy, RABoykow, GCKowalski, TJSpar, BDStamford, AWChackalamannil, SLachowicz, JEGreenlee, WJ Diaryl piperidines as CB1 receptor antagonists. Bioorg Med Chem Lett20:1278-83 (2010) 
 
Cannabinoid receptor 1
Name:Cannabinoid receptor 1
Type:G Protein-Coupled Receptor (GPCR)
Mol. Mass.:52868.96
Organism:Homo sapiens (Human)
Description:P21554
Residue:472
BDBM50309038
NameBDBM50309038
Synonyms:1-(((3S,6S)-1-(4-chlorophenyl)-6-(2,4-dichlorophenyl)piperidin-3-yl)methyl)-4-(cyclopropylsulfonyl)piperazine | CHEMBL591509
TypeSmall organic molecule
Emp. Form.C25H30Cl3N3O2S
Mol. Mass.542.949
SMILESClc1ccc(cc1)N1C[C@H](CN2CCN(CC2)S(=O)(=O)C2CC2)CC[C@H]1c1ccc(Cl)cc1Cl