Reaction Details
TargetCannabinoid receptor 1
LigandBDBM50309544
Substrate/Competitorn/a
Meas. Tech.ChEMBL_609767 (CHEMBL1069385)
Ki>10000±n/a nM
Citation Lange, JHvan der Neut, MAWals, HCKuil, GDBorst, AJMulder, Aden Hartog, APZilaout, HGoutier, Wvan Stuivenberg, HHvan Vliet, BJ Synthesis and SAR of novel imidazoles as potent and selective cannabinoid CB2 receptor antagonists with high binding efficiencies. Bioorg Med Chem Lett20:1084-9 (2010) 
 
Cannabinoid receptor 1
Name:Cannabinoid receptor 1
Type:G Protein-Coupled Receptor (GPCR)
Mol. Mass.:52868.96
Organism:Homo sapiens (Human)
Description:P21554
Residue:472
BDBM50309544
NameBDBM50309544
Synonyms:2-Methyl-5-methylsulfanyl-1-phenyl-1H-imidazole-4-carboxylic acid adamantan-1-ylamide | CHEMBL596671
TypeSmall organic molecule
Emp. Form.C22H27N3OS
Mol. Mass.381.534
SMILESCSc1c(nc(C)n1-c1ccccc1)C(=O)NC12CC3CC(CC(C3)C1)C2