Reaction Details
TargetCannabinoid receptor 1
LigandBDBM50309545
Substrate/Competitorn/a
Meas. Tech.ChEMBL_609767 (CHEMBL1069385)
Ki>1000±n/a nM
Citation Lange, JHvan der Neut, MAWals, HCKuil, GDBorst, AJMulder, Aden Hartog, APZilaout, HGoutier, Wvan Stuivenberg, HHvan Vliet, BJ Synthesis and SAR of novel imidazoles as potent and selective cannabinoid CB2 receptor antagonists with high binding efficiencies. Bioorg Med Chem Lett20:1084-9 (2010) 
 
Cannabinoid receptor 1
Name:Cannabinoid receptor 1
Type:G Protein-Coupled Receptor (GPCR)
Mol. Mass.:52868.96
Organism:Homo sapiens (Human)
Description:P21554
Residue:472
BDBM50309545
NameBDBM50309545
Synonyms:2,5-Dichloro-1-phenyl-1H-imidazole-4-carboxylic acid adamantan-1-ylamide | CHEMBL597083
TypeSmall organic molecule
Emp. Form.C20H21Cl2N3O
Mol. Mass.390.306
SMILESClc1nc(C(=O)NC23CC4CC(CC(C4)C2)C3)c(Cl)n1-c1ccccc1