Reaction Details
TargetCannabinoid receptor 2
LigandBDBM50309542
Substrate/Competitorn/a
Meas. Tech.ChEMBL_609766 (CHEMBL1069384)
Ki 23.8±n/a nM
Citation Lange, JHvan der Neut, MAWals, HCKuil, GDBorst, AJMulder, Aden Hartog, APZilaout, HGoutier, Wvan Stuivenberg, HHvan Vliet, BJ Synthesis and SAR of novel imidazoles as potent and selective cannabinoid CB2 receptor antagonists with high binding efficiencies. Bioorg Med Chem Lett20:1084-9 (2010) 
 
Cannabinoid receptor 2
Name:Cannabinoid receptor 2
Type:G Protein-Coupled Receptor (GPCR)
Mol. Mass.:39690.94
Organism:Homo sapiens (Human)
Description:P34972
Residue:360
BDBM50309542
NameBDBM50309542
Synonyms:5-Chloro-2-methyl-1-phenyl-1H-imidazole-4-carboxylic acid adamantan-1-ylamide | CHEMBL596626
TypeSmall organic molecule
Emp. Form.C21H24ClN3O
Mol. Mass.369.888
SMILESCc1nc(C(=O)NC23CC4CC(CC(C4)C2)C3)c(Cl)n1-c1ccccc1