Reaction Details
TargetCannabinoid receptor 1
LigandBDBM50309532
Substrate/Competitorn/a
Meas. Tech.ChEMBL_609767 (CHEMBL1069385)
Ki>10000±n/a nM
Citation Lange, JHvan der Neut, MAWals, HCKuil, GDBorst, AJMulder, Aden Hartog, APZilaout, HGoutier, Wvan Stuivenberg, HHvan Vliet, BJ Synthesis and SAR of novel imidazoles as potent and selective cannabinoid CB2 receptor antagonists with high binding efficiencies. Bioorg Med Chem Lett20:1084-9 (2010) 
 
Cannabinoid receptor 1
Name:Cannabinoid receptor 1
Type:G Protein-Coupled Receptor (GPCR)
Mol. Mass.:52868.96
Organism:Homo sapiens (Human)
Description:P21554
Residue:472
BDBM50309532
NameBDBM50309532
Synonyms:CHEMBL603476 | N-(((cis)-6,6-dimethylbicyclo[3.1.1]heptan-3-yl)methyl)-5-methyl-1-phenyl-1H-imidazole-4-carboxamide
TypeSmall organic molecule
Emp. Form.C21H27N3O
Mol. Mass.337.4586
SMILESCc1c(ncn1-c1ccccc1)C(=O)NC[C@H]1C[C@@H]2C[C@H](C1)C2(C)C