Reaction Details
TargetCannabinoid receptor 1
LigandBDBM50309540
Substrate/Competitorn/a
Meas. Tech.ChEMBL_609767 (CHEMBL1069385)
Ki 4152±n/a nM
Citation Lange, JHvan der Neut, MAWals, HCKuil, GDBorst, AJMulder, Aden Hartog, APZilaout, HGoutier, Wvan Stuivenberg, HHvan Vliet, BJ Synthesis and SAR of novel imidazoles as potent and selective cannabinoid CB2 receptor antagonists with high binding efficiencies. Bioorg Med Chem Lett20:1084-9 (2010) 
 
Cannabinoid receptor 1
Name:Cannabinoid receptor 1
Type:G Protein-Coupled Receptor (GPCR)
Mol. Mass.:52868.96
Organism:Homo sapiens (Human)
Description:P21554
Residue:472
BDBM50309540
NameBDBM50309540
Synonyms:2-Ethyl-5-methyl-1-phenyl-1H-imidazole-4-carboxylic acid adamantan-1-ylamide | CHEMBL599882
TypeSmall organic molecule
Emp. Form.C23H29N3O
Mol. Mass.363.4959
SMILESCCc1nc(C(=O)NC23CC4CC(CC(C4)C2)C3)c(C)n1-c1ccccc1