Reaction Details
TargetHeat shock protein HSP 90-beta
LigandBDBM50030868
Substrate/Competitorn/a
Meas. Tech.ChEMBL_616144 (CHEMBL1103007)
IC50 12±n/a nM
Citation Biamonte, MAVan de Water, RArndt, JWScannevin, RHPerret, DLee, WC Heat shock protein 90: inhibitors in clinical trials. J Med Chem53:3-17 (2010) 
 
Heat shock protein HSP 90-beta
Name:Heat shock protein HSP 90-beta
Type:Molecular Chaperone
Mol. Mass.:83229.45
Organism:Homo sapiens (Human)
Description:P08238
Residue:724
BDBM50030868
NameBDBM50030868
Synonyms:(8S,9S,12S,13R,14S,16R)-19-amino-13-hydroxy-8,14-dimethoxy-4,10,12,16-tetramethyl-3,20,22-trioxo-2-azabicyclo[16.3.1]docosa-1(21),4,6,10,18-pentaen-9-yl carbamate 17-desmethoxy-17-aminogeldanamycin Carbamic acid (4E,6Z)-(13S,14S,17R,19S)-19-amino-13-(S)-hydroxy-8,14-dimethoxy-4,12,16-trimethyl-10-(R)-methyl-3,20,22-trioxo-2-aza-bicyclo[16.3.1]docosa-1(21),4,6,10,18-pentaen-9-yl ester | Carbamic acid (4E,6Z,10E)-(8S,9S,12S,13R,14S,16R)-19-amino-13-hydroxy-8,14-dimethoxy-4,10,12,16-tetramethyl-3,20,22-trioxo-2-aza-bicyclo[16.3.1]docosa-1(21),4,6,10,18-pentaen-9-yl ester
TypeSmall organic molecule
Emp. Form.C28H39N3O8
Mol. Mass.545.6246
SMILESCO[C@H]1CC(C)=Cc2c(N)c(O)cc(NC(=O)C(C)=CC=C[C@H](OC)[C@@H](OC(N)=O)\C(C)=C\[C@H](C)[C@H]1O)c2O