Reaction Details
TargetVascular endothelial growth factor receptor 2
LigandBDBM50313050
Substrate/Competitorn/a
Meas. Tech.ChEMBL_616306 (CHEMBL1102109)
Ki 1800±n/a nM
Citation Arnost, MPierce, Ater Haar, ELauffer, DMadden, JTanner, KGreen, J 3-Aryl-4-(arylhydrazono)-1H-pyrazol-5-ones: Highly ligand efficient and potent inhibitors of GSK3beta. Bioorg Med Chem Lett20:1661-4 (2010) 
 
Vascular endothelial growth factor receptor 2
Name:Vascular endothelial growth factor receptor 2
Type:Receptor Tyrosine Kinase
Mol. Mass.:151510.97
Organism:Homo sapiens (Human)
Description:P35968
Residue:1356
BDBM50313050
NameBDBM50313050
Synonyms:(Z)-3-(4-methoxyphenyl)-4-(2-(3-methoxyphenyl)hydrazono)-1H-pyrazol-5(4H)-one | CHEMBL1080902
TypeSmall organic molecule
Emp. Form.C17H16N4O3
Mol. Mass.324.3339
SMILESCOc1ccc(cc1)-c1[nH][nH]c(=O)c1N=Nc1cccc(OC)c1