Reaction Details
TargetGlycogen synthase kinase-3 beta
LigandBDBM50313058
Substrate/Competitorn/a
Meas. Tech.ChEMBL_616299 (CHEMBL1102102)
Ki 87±n/a nM
Citation Arnost, MPierce, Ater Haar, ELauffer, DMadden, JTanner, KGreen, J 3-Aryl-4-(arylhydrazono)-1H-pyrazol-5-ones: Highly ligand efficient and potent inhibitors of GSK3beta. Bioorg Med Chem Lett20:1661-4 (2010) 
 
Glycogen synthase kinase-3 beta
Name:Glycogen synthase kinase-3 beta
Type:Enzyme
Mol. Mass.:46756.38
Organism:Homo sapiens (Human)
Description:P49841
Residue:420
BDBM50313058
NameBDBM50313058
Synonyms:(Z)-3-(3,4-dimethoxyphenyl)-4-(2-(4-(dimethylamino)phenyl)hydrazono)-1H-pyrazol-5(4H)-one | CHEMBL1086601
TypeSmall organic molecule
Emp. Form.C19H21N5O3
Mol. Mass.367.4017
SMILESCOc1ccc(cc1OC)-c1[nH][nH]c(=O)c1N=Nc1ccc(cc1)N(C)C