Reaction Details
TargetGlycogen synthase kinase-3 beta
LigandBDBM50313029
Substrate/Competitorn/a
Meas. Tech.ChEMBL_616299 (CHEMBL1102102)
Ki 20±n/a nM
Citation Arnost, MPierce, Ater Haar, ELauffer, DMadden, JTanner, KGreen, J 3-Aryl-4-(arylhydrazono)-1H-pyrazol-5-ones: Highly ligand efficient and potent inhibitors of GSK3beta. Bioorg Med Chem Lett20:1661-4 (2010) 
 
Glycogen synthase kinase-3 beta
Name:Glycogen synthase kinase-3 beta
Type:Enzyme
Mol. Mass.:46756.38
Organism:Homo sapiens (Human)
Description:P49841
Residue:420
BDBM50313029
NameBDBM50313029
Synonyms:(Z)-4-(2-(4-methoxyphenyl)hydrazono)-3-phenyl-1H-pyrazol-5(4H)-one | CHEMBL1076682
TypeSmall organic molecule
Emp. Form.C16H14N4O2
Mol. Mass.294.308
SMILESCOc1ccc(cc1)N=Nc1c([nH][nH]c1=O)-c1ccccc1