Reaction Details
TargetGlycogen synthase kinase-3 beta
LigandBDBM50313039
Substrate/Competitorn/a
Meas. Tech.ChEMBL_616299 (CHEMBL1102102)
Ki 9±n/a nM
Citation Arnost, MPierce, Ater Haar, ELauffer, DMadden, JTanner, KGreen, J 3-Aryl-4-(arylhydrazono)-1H-pyrazol-5-ones: Highly ligand efficient and potent inhibitors of GSK3beta. Bioorg Med Chem Lett20:1661-4 (2010) 
 
Glycogen synthase kinase-3 beta
Name:Glycogen synthase kinase-3 beta
Type:Enzyme
Mol. Mass.:46756.38
Organism:Homo sapiens (Human)
Description:P49841
Residue:420
BDBM50313039
NameBDBM50313039
Synonyms:(Z)-4-(2-(4-chlorophenyl)hydrazono)-3-(3-methoxyphenyl)-1H-pyrazol-5(4H)-one | CHEMBL1076695
TypeSmall organic molecule
Emp. Form.C16H13ClN4O2
Mol. Mass.328.753
SMILESCOc1cccc(c1)-c1[nH][nH]c(=O)c1N=Nc1ccc(Cl)cc1