Reaction Details
TargetAurora kinase A
LigandBDBM50204694
Substrate/Competitorn/a
Meas. Tech.ChEMBL_627204 (CHEMBL1114558)
IC50 8090±n/a nM
Citation Zuccotto, FArdini, ECasale, EAngiolini, M Through the"gatekeeper door": exploiting the active kinase conformation. J Med Chem53:2681-94 (2010) 
 
Aurora kinase A
Name:Aurora kinase A
Type:Serine/threonine-protein kinase
Mol. Mass.:45830.98
Organism:Homo sapiens (Human)
Description:O14965
Residue:403
BDBM50204694
NameBDBM50204694
Synonyms:3-(4'-HYDROXYBIPHENYL-4-YL)-N-(4-HYDROXYCYCLOHEXYL)-1,4-DIHYDROINDENO[1,2-C]PYRAZOLE-6-CARBOXAMIDE 3-(4'-hydroxybiphenyl-4-yl)-N-((1r,4r)-4-hydroxycyclohexyl)-1,4-dihydroindeno[1,2-c]pyrazole-6-carboxamide CHEMBL438485
TypeSmall organic molecule
Emp. Form.C29H27N3O3
Mol. Mass.465.543
SMILESO[C@H]1CC[C@@H](CC1)NC(=O)c1ccc-2c(Cc3c(n[nH]c-23)-c2ccc(cc2)-c2ccc(O)cc2)c1