Reaction Details
TargetThymidylate synthase
LigandBDBM50314076
Substrate/Competitorn/a
Meas. Tech.ChEMBL_627425 (CHEMBL1115355)
IC50 540±n/a nM
Citation Gangjee, AZaware, NRaghavan, SIhnat, MShenoy, SKisliuk, RL Single agents with designed combination chemotherapy potential: synthesis and evaluation of substituted pyrimido[4,5-b]indoles as receptor tyrosine kinase and thymidylate synthase inhibitors and as antitumor agents. J Med Chem53:1563-78 (2010) 
 
Thymidylate synthase
Name:Thymidylate synthase
Type:Enzyme
Mol. Mass.:35718.07
Organism:Homo sapiens (Human)
Description:n/a
Residue:313
BDBM50314076
NameBDBM50314076
Synonyms:5-(phenylthio)-9H-pyrimido[4,5-b]indole-2,4-diamine US9422297, AAG-148-43
TypeSmall organic molecule
Emp. Form.C16H13N5S
Mol. Mass.307.373
SMILESNc1nc(N)c2c(n1)[nH]c1cccc(Sc3ccccc3)c21