Reaction Details
TargetVesicular acetylcholine transporter
LigandBDBM50378723
Substrate/Competitorn/a
Meas. Tech.ChEMBL_627490 (CHEMBL1111776)
Ki 0.54±n/a nM
Citation Efange, SMKhare, ABvon Hohenberg, KMach, RHParsons, SMTu, Z Synthesis and in vitro biological evaluation of carbonyl group-containing inhibitors of vesicular acetylcholine transporter. J Med Chem53:2825-35 (2010) 
 
Vesicular acetylcholine transporter
Name:Vesicular acetylcholine transporter
Type:PROTEIN
Mol. Mass.:56111.93
Organism:Torpedo californica
Description:ChEMBL_1503355
Residue:515
BDBM50378723
NameBDBM50378723
Synonyms:CHEMBL1204037
TypeSmall organic molecule
Emp. Form.C20H22BrNO2S
Mol. Mass.420.363
SMILESO[C@@H]1Cc2ccccc2C[C@H]1N1CCC(CC1)C(=O)c1ccc(Br)s1