Reaction Details
TargetVesicular acetylcholine transporter
LigandBDBM50378733
Substrate/Competitorn/a
Meas. Tech.ChEMBL_627490 (CHEMBL1111776)
Ki 2.07±n/a nM
Citation Efange, SMKhare, ABvon Hohenberg, KMach, RHParsons, SMTu, Z Synthesis and in vitro biological evaluation of carbonyl group-containing inhibitors of vesicular acetylcholine transporter. J Med Chem53:2825-35 (2010) 
 
Vesicular acetylcholine transporter
Name:Vesicular acetylcholine transporter
Type:PROTEIN
Mol. Mass.:56111.93
Organism:Torpedo californica
Description:ChEMBL_1503355
Residue:515
BDBM50378733
NameBDBM50378733
Synonyms:CHEMBL1204047
TypeSmall organic molecule
Emp. Form.C27H34N2O2
Mol. Mass.418.5711
SMILESO[C@@H]1Cc2ccccc2C[C@H]1N1CCC(CC1)C(=O)N1CCC(CC1)c1ccccc1