Reaction Details
TargetAdenosine receptor A1
LigandBDBM50315538
Substrate/Competitorn/a
Meas. Tech.ChEMBL_627305 (CHEMBL1105451)
Ki 0.096±n/a nM
Citation Mishra, CBBarodia, SKPrakash, ASenthil Kumar, JBLuthra, PM Novel 8-(furan-2-yl)-3-substituted thiazolo [5,4-e][1,2,4] triazolo[1,5-c] pyrimidine-2(3H)-thione derivatives as potential adenosine A(2A) receptor antagonists. Bioorg Med Chem18:2491-500 (2010) 
 
Adenosine receptor A1
Name:Adenosine receptor A1
Type:G Protein-Coupled Receptor (GPCR)
Mol. Mass.:36520.92
Organism:Homo sapiens (Human)
Description:P30542
Residue:326
BDBM50315538
NameBDBM50315538
Synonyms:8-(2-Thioxo-7(3-ethyl)-2-(2-furyl)thiazolo[4,3-e]1,2,4-triazolo[1,5-c]pyrimidine | CHEMBL1093271
TypeSmall organic molecule
Emp. Form.C12H9N5OS2
Mol. Mass.303.363
SMILESCCn1c2ncn3nc(nc3c2sc1=S)-c1ccco1