Reaction Details
TargetTransient receptor potential cation channel subfamily V member 1
LigandBDBM50315609
Substrate/Competitorn/a
Meas. Tech.ChEMBL_627601 (CHEMBL1113607)
IC50 0.83±n/a nM
Citation Blum, CACaldwell, TZheng, XBakthavatchalam, RCapitosti, SBrielmann, HDe Lombaert, SKershaw, MTMatson, DKrause, JECortright, DCrandall, MMartin, WJMurphy, BABoyce, SJones, ABMason, GRycroft, WPerrett, HConley, RBurnaby-Davies, NChenard, BLHodgetts, KJ Discovery of novel 6,6-heterocycles as transient receptor potential vanilloid (TRPV1) antagonists. J Med Chem53:3330-48 (2010) 
 
Transient receptor potential cation channel subfamily V member 1
Name:Transient receptor potential cation channel subfamily V member 1
Type:Protein
Mol. Mass.:94960.75
Organism:Homo sapiens (Human)
Description:Q8NER1
Residue:839
BDBM50315609
NameBDBM50315609
Synonyms:(4-Trifluoromethylphenyl)-[7-(3-trifluoromethylpyridin-2-yl)-pyrido[2,3-d]pyrimidin-4-yl]amine | CHEMBL1092852
TypeSmall organic molecule
Emp. Form.C20H11F6N5
Mol. Mass.435.3253
SMILESFC(F)(F)c1ccc(Nc2ncnc3nc(ccc23)-c2ncccc2C(F)(F)F)cc1