Reaction Details
TargetTransient receptor potential cation channel subfamily V member 1
LigandBDBM50272850
Substrate/Competitorn/a
Meas. Tech.ChEMBL_627603 (CHEMBL1113609)
IC50 1.5±n/a nM
Citation Blum, CACaldwell, TZheng, XBakthavatchalam, RCapitosti, SBrielmann, HDe Lombaert, SKershaw, MTMatson, DKrause, JECortright, DCrandall, MMartin, WJMurphy, BABoyce, SJones, ABMason, GRycroft, WPerrett, HConley, RBurnaby-Davies, NChenard, BLHodgetts, KJ Discovery of novel 6,6-heterocycles as transient receptor potential vanilloid (TRPV1) antagonists. J Med Chem53:3330-48 (2010) 
 
Transient receptor potential cation channel subfamily V member 1
Name:Transient receptor potential cation channel subfamily V member 1
Type:Protein
Mol. Mass.:94960.75
Organism:Homo sapiens (Human)
Description:Q8NER1
Residue:839
BDBM50272850
NameBDBM50272850
Synonyms:2-(methoxymethyl)-N-(4-(trifluoromethyl)phenyl)-7-(3-(trifluoromethyl)pyridin-2-yl)quinazolin-4-amine | CHEMBL497650
TypeSmall organic molecule
Emp. Form.C23H16F6N4O
Mol. Mass.478.3898
SMILESCOCc1nc(Nc2ccc(cc2)C(F)(F)F)c2ccc(cc2n1)-c1ncccc1C(F)(F)F