Reaction Details
TargetcGMP-specific 3',5'-cyclic phosphodiesterase
LigandBDBM50316640
Substrate/Competitorn/a
Meas. Tech.ChEMBL_632193 (CHEMBL1106526)
IC50 0.007±n/a nM
Citation Tollefson, MBAcker, BAJacobsen, EJHughes, ROWalker, JKFox, DNPalmer, MJFreeman, SKYu, YBond, BR 1-(2-Ethoxyethyl)-1H-pyrazolo[4,3-d]pyrimidines as potent phosphodiesterase 5 (PDE5) inhibitors. Bioorg Med Chem Lett20:3120-4 (2010) cGMP-specific 3',5'-cyclic phosphodiesterase
Name:cGMP-specific 3',5'-cyclic phosphodiesterase
Type:Protein
Mol. Mass.:99975.83
Organism:Homo sapiens (Human)
Description:O76074
Residue:875
BDBM50316640
NameBDBM50316640
Synonyms:5-(4-(aminomethyl)piperidin-1-yl)-1-(2-ethoxyethyl)-3-ethyl-N-(4-methylpyridin-2-yl)-1H-pyrazolo[4,3-d]pyrimidin-7-amine | CHEMBL1094489
TypeSmall organic molecule
Emp. Form.C23H34N8O
Mol. Mass.438.5691
SMILESCCOCCn1nc(CC)c2nc(nc(Nc3cc(C)ccn3)c12)N1CCC(CN)CC1