Reaction Details
TargetcGMP-specific 3',5'-cyclic phosphodiesterase
LigandBDBM50316638
Substrate/Competitorn/a
Meas. Tech.ChEMBL_632193 (CHEMBL1106526)
IC50 0.01±n/a nM
Citation Tollefson, MBAcker, BAJacobsen, EJHughes, ROWalker, JKFox, DNPalmer, MJFreeman, SKYu, YBond, BR 1-(2-Ethoxyethyl)-1H-pyrazolo[4,3-d]pyrimidines as potent phosphodiesterase 5 (PDE5) inhibitors. Bioorg Med Chem Lett20:3120-4 (2010) cGMP-specific 3',5'-cyclic phosphodiesterase
Name:cGMP-specific 3',5'-cyclic phosphodiesterase
Type:Protein
Mol. Mass.:99975.83
Organism:Homo sapiens (Human)
Description:O76074
Residue:875
BDBM50316638
NameBDBM50316638
Synonyms:1-(2-ethoxyethyl)-3-ethyl-N7-(4-methylpyridin-2-yl)-N5-(piperidin-4-ylmethyl)-1H-pyrazolo[4,3-d]pyrimidine-5,7-diamine | CHEMBL1098465
TypeSmall organic molecule
Emp. Form.C23H34N8O
Mol. Mass.438.5691
SMILESCCOCCn1nc(CC)c2nc(NCC3CCNCC3)nc(Nc3cc(C)ccn3)c12