Reaction Details
TargetMelatonin receptor type 1A
LigandBDBM50316706
Substrate/Competitorn/a
Meas. Tech.ChEMBL_632475 (CHEMBL1108339)
EC50 1.9±n/a nM
Citation Mésangeau, CPérès, BDescamps-François, CChavatte, PAudinot, VCoumailleau, SBoutin, JADelagrange, PBennejean, CRenard, PCaignard, DHBerthelot, PYous, S Design, synthesis and pharmacological evaluation of novel naphthalenic derivatives as selective MT(1) melatoninergic ligands. Bioorg Med Chem18:3426-36 (2010) 
 
Melatonin receptor type 1A
Name:Melatonin receptor type 1A
Type:Enzyme
Mol. Mass.:39392.94
Organism:Homo sapiens (Human)
Description:P48039
Residue:350
BDBM50316706
NameBDBM50316706
Synonyms:CHEMBL1097497 | N-[2-(7-{4-[3-(2-Acetylaminoethyl)benzo[b]thiophen-5-yloxy]butoxy}naphthalen-1-yl)ethyl]acetamide
TypeSmall organic molecule
Emp. Form.C30H34N2O4S
Mol. Mass.518.667
SMILESCC(=O)NCCc1csc2ccc(OCCCCOc3ccc4cccc(CCNC(C)=O)c4c3)cc12