Reaction Details
TargetMelatonin receptor type 1B
LigandBDBM50316702
Substrate/Competitorn/a
Meas. Tech.ChEMBL_632479 (CHEMBL1108343)
EC50>10000±n/a nM
Citation Mésangeau, CPérès, BDescamps-François, CChavatte, PAudinot, VCoumailleau, SBoutin, JADelagrange, PBennejean, CRenard, PCaignard, DHBerthelot, PYous, S Design, synthesis and pharmacological evaluation of novel naphthalenic derivatives as selective MT(1) melatoninergic ligands. Bioorg Med Chem18:3426-36 (2010) 
 
Melatonin receptor type 1B
Name:Melatonin receptor type 1B
Type:Enzyme
Mol. Mass.:40203.54
Organism:Homo sapiens (Human)
Description:P49286
Residue:362
BDBM50316702
NameBDBM50316702
Synonyms:CHEMBL1097496 | N-[2-(7-{4-[3-(2-acetylaminoethyl)benzofuran-5-yloxy]butoxy}naphthalen-1-yl)ethyl]-acetamide
TypeSmall organic molecule
Emp. Form.C30H34N2O5
Mol. Mass.502.6014
SMILESCC(=O)NCCc1coc2ccc(OCCCCOc3ccc4cccc(CCNC(C)=O)c4c3)cc12