Reaction Details
TargetMelatonin receptor type 1A
LigandBDBM50316701
Substrate/Competitorn/a
Meas. Tech.ChEMBL_632470 (CHEMBL1108334)
Ki 1.5±n/a nM
Citation Mésangeau, CPérès, BDescamps-François, CChavatte, PAudinot, VCoumailleau, SBoutin, JADelagrange, PBennejean, CRenard, PCaignard, DHBerthelot, PYous, S Design, synthesis and pharmacological evaluation of novel naphthalenic derivatives as selective MT(1) melatoninergic ligands. Bioorg Med Chem18:3426-36 (2010) 
 
Melatonin receptor type 1A
Name:Melatonin receptor type 1A
Type:Enzyme
Mol. Mass.:39392.94
Organism:Homo sapiens (Human)
Description:P48039
Residue:350
BDBM50316701
NameBDBM50316701
Synonyms:CHEMBL1095505 | N-[2-(7-{4-[6-(1-Carboxyethyl)naphthalen-2-yloxy]-butoxy}naphthalen-1-yl)ethyl]acetamide
TypeSmall organic molecule
Emp. Form.C31H33NO5
Mol. Mass.499.5974
SMILESCC(C(O)=O)c1ccc2cc(OCCCCOc3ccc4cccc(CCNC(C)=O)c4c3)ccc2c1