Reaction Details
TargetMelatonin receptor type 1A
LigandBDBM50316705
Substrate/Competitorn/a
Meas. Tech.ChEMBL_632470 (CHEMBL1108334)
Ki 9.1±n/a nM
Citation Mésangeau, CPérès, BDescamps-François, CChavatte, PAudinot, VCoumailleau, SBoutin, JADelagrange, PBennejean, CRenard, PCaignard, DHBerthelot, PYous, S Design, synthesis and pharmacological evaluation of novel naphthalenic derivatives as selective MT(1) melatoninergic ligands. Bioorg Med Chem18:3426-36 (2010) 
 
Melatonin receptor type 1A
Name:Melatonin receptor type 1A
Type:Enzyme
Mol. Mass.:39392.94
Organism:Homo sapiens (Human)
Description:P48039
Residue:350
BDBM50316705
NameBDBM50316705
Synonyms:CHEMBL1095504 | N-[2-{7-(4-[8-(carboxymethyl)naphthalen-2-yloxy]butoxy)naphthalen-1-yl}ethyl]acetamide
TypeSmall organic molecule
Emp. Form.C30H31NO5
Mol. Mass.485.5708
SMILESCC(=O)NCCc1cccc2ccc(OCCCCOc3ccc4cccc(CC(O)=O)c4c3)cc12