Reaction Details
TargetMelatonin receptor type 1B
LigandBDBM50316691
Substrate/Competitorn/a
Meas. Tech.ChEMBL_632471 (CHEMBL1108335)
Ki 12±n/a nM
Citation Mésangeau, CPérès, BDescamps-François, CChavatte, PAudinot, VCoumailleau, SBoutin, JADelagrange, PBennejean, CRenard, PCaignard, DHBerthelot, PYous, S Design, synthesis and pharmacological evaluation of novel naphthalenic derivatives as selective MT(1) melatoninergic ligands. Bioorg Med Chem18:3426-36 (2010) 
 
Melatonin receptor type 1B
Name:Melatonin receptor type 1B
Type:Enzyme
Mol. Mass.:40203.54
Organism:Homo sapiens (Human)
Description:P49286
Residue:362
BDBM50316691
NameBDBM50316691
Synonyms:CHEMBL1096991 | N-[2-(7-{4-[8-(2-(2-Furoyl)aminoethyl)naphthalen-2-yloxy]butoxy}naphthalen-1-yl}ethyl]acetamide
TypeSmall organic molecule
Emp. Form.C35H36N2O5
Mol. Mass.564.6707
SMILESCC(=O)NCCc1cccc2ccc(OCCCCOc3ccc4cccc(CCNC(=O)c5ccco5)c4c3)cc12