Reaction Details
TargetMelatonin receptor type 1B
LigandBDBM50316695
Substrate/Competitorn/a
Meas. Tech.ChEMBL_632471 (CHEMBL1108335)
Ki 51±n/a nM
Citation Mésangeau, CPérès, BDescamps-François, CChavatte, PAudinot, VCoumailleau, SBoutin, JADelagrange, PBennejean, CRenard, PCaignard, DHBerthelot, PYous, S Design, synthesis and pharmacological evaluation of novel naphthalenic derivatives as selective MT(1) melatoninergic ligands. Bioorg Med Chem18:3426-36 (2010) 
 
Melatonin receptor type 1B
Name:Melatonin receptor type 1B
Type:Enzyme
Mol. Mass.:40203.54
Organism:Homo sapiens (Human)
Description:P49286
Residue:362
BDBM50316695
NameBDBM50316695
Synonyms:CHEMBL1094546 | N-[2-(7-{4-(4'-Carboxybiphenyl-4-yloxy)butoxy}-naphthalen-1-yl)ethyl]acetamide
TypeSmall organic molecule
Emp. Form.C31H31NO5
Mol. Mass.497.5815
SMILESCC(=O)NCCc1cccc2ccc(OCCCCOc3ccc(cc3)-c3ccc(cc3)C(O)=O)cc12