Reaction Details
TargetProlyl endopeptidase
LigandBDBM50316833
Substrate/Competitorn/a
Meas. Tech.ChEMBL_632258 (CHEMBL1110120)
Ki 2900±n/a nM
Citation Lawandi, JGerber-Lemaire, SJuillerat-Jeanneret, LMoitessier, N Inhibitors of prolyl oligopeptidases for the therapy of human diseases: defining diseases and inhibitors. J Med Chem53:3423-38 (2010) 
 
Prolyl endopeptidase
Name:Prolyl endopeptidase
Type:PROTEIN
Mol. Mass.:80630.39
Organism:Bos taurus
Description:ChEMBL_632258
Residue:710
BDBM50316833
NameBDBM50316833
Synonyms:(S)-benzyl 2-(oxazolidine-3-carbonyl)pyrrolidine-1-carboxylate | CHEMBL1088413
TypeSmall organic molecule
Emp. Form.C16H20N2O4
Mol. Mass.304.341
SMILESO=C(OCc1ccccc1)N1CCC[C@H]1C(=O)N1CCOC1