Reaction Details
TargetProlyl endopeptidase
LigandBDBM50316818
Substrate/Competitorn/a
Meas. Tech.ChEMBL_632265 (CHEMBL1110127)
Ki 1.5±n/a nM
Citation Lawandi, JGerber-Lemaire, SJuillerat-Jeanneret, LMoitessier, N Inhibitors of prolyl oligopeptidases for the therapy of human diseases: defining diseases and inhibitors. J Med Chem53:3423-38 (2010) 
 
Prolyl endopeptidase
Name:Prolyl endopeptidase
Type:Enzyme
Mol. Mass.:80688.50
Organism:Homo sapiens (Human)
Description:P48147
Residue:710
BDBM50316818
NameBDBM50316818
Synonyms:((2S,3aS,7aS)-1-((1R,2R)-2-phenylcyclopropanecarbonyl)octahydro-1H-indol-2-yl)(thiazolidin-3-yl)methanone | CHEMBL1086968
TypeSmall organic molecule
Emp. Form.C22H28N2O2S
Mol. Mass.384.535
SMILESO=C([C@@H]1C[C@H]1c1ccccc1)N1[C@H]2CCCC[C@H]2C[C@H]1C(=O)N1CCSC1