Reaction Details
TargetProlyl endopeptidase
LigandBDBM50200730
Substrate/Competitorn/a
Meas. Tech.ChEMBL_632270 (CHEMBL1110132)
Ki 211±n/a nM
Citation Lawandi, JGerber-Lemaire, SJuillerat-Jeanneret, LMoitessier, N Inhibitors of prolyl oligopeptidases for the therapy of human diseases: defining diseases and inhibitors. J Med Chem53:3423-38 (2010) 
 
Prolyl endopeptidase
Name:Prolyl endopeptidase
Type:Enzyme
Mol. Mass.:80688.50
Organism:Homo sapiens (Human)
Description:P48147
Residue:710
BDBM50200730
NameBDBM50200730
Synonyms:(R)-1-(2-acetamidoacetyl)pyrrolidin-2-ylboronic acid | CHEMBL217561
TypeSmall organic molecule
Emp. Form.C8H15BN2O4
Mol. Mass.214.027
SMILESCC(=O)NCC(=O)N1CCC[C@H]1B(O)O