Reaction Details
TargetCannabinoid receptor 2
LigandBDBM50317254
Substrate/Competitorn/a
Meas. Tech.ChEMBL_631541 (CHEMBL1103906)
Ki 325±n/a nM
Citation Lange, JHvan der Neut, MABorst, AJYildirim, Mvan Stuivenberg, HHvan Vliet, BJKruse, CG Probing the cannabinoid CB1/CB2 receptor subtype selectivity limits of 1,2-diarylimidazole-4-carboxamides by fine-tuning their 5-substitution pattern. Bioorg Med Chem Lett20:2770-5 (2010) 
 
Cannabinoid receptor 2
Name:Cannabinoid receptor 2
Type:G Protein-Coupled Receptor (GPCR)
Mol. Mass.:39690.94
Organism:Homo sapiens (Human)
Description:P34972
Residue:360
BDBM50317254
NameBDBM50317254
Synonyms:CHEMBL1088507 | N-(azepan-1-yl)-1-(4-chlorophenyl)-2-(2,4-dichlorophenyl)-5-(methylthio)-1H-imidazole-4-carboxamide
TypeSmall organic molecule
Emp. Form.C23H23Cl3N4OS
Mol. Mass.509.879
SMILESCSc1c(nc(-c2ccc(Cl)cc2Cl)n1-c1ccc(Cl)cc1)C(=O)NN1CCCCCC1