Reaction Details
TargetCannabinoid receptor 2
LigandBDBM50317245
Substrate/Competitorn/a
Meas. Tech.ChEMBL_631541 (CHEMBL1103906)
Ki 398±n/a nM
Citation Lange, JHvan der Neut, MABorst, AJYildirim, Mvan Stuivenberg, HHvan Vliet, BJKruse, CG Probing the cannabinoid CB1/CB2 receptor subtype selectivity limits of 1,2-diarylimidazole-4-carboxamides by fine-tuning their 5-substitution pattern. Bioorg Med Chem Lett20:2770-5 (2010) 
 
Cannabinoid receptor 2
Name:Cannabinoid receptor 2
Type:G Protein-Coupled Receptor (GPCR)
Mol. Mass.:39690.94
Organism:Homo sapiens (Human)
Description:P34972
Residue:360
BDBM50317245
NameBDBM50317245
Synonyms:5-(4-chlorophenyl)-1-(2,4-dichlorophenyl)-4-(methylsulfinyl)-N-(piperidin-1-yl)-1H-pyrazole-3-carboxamide | CHEMBL1098696
TypeSmall organic molecule
Emp. Form.C22H21Cl3N4O2S
Mol. Mass.511.852
SMILESCS(=O)c1c(nn(c1-c1ccc(Cl)cc1)-c1ccc(Cl)cc1Cl)C(=O)NN1CCCCC1