Reaction Details
TargetCannabinoid receptor 1
LigandBDBM50317251
Substrate/Competitorn/a
Meas. Tech.ChEMBL_631539 (CHEMBL1103904)
Ki 12±n/a nM
Citation Lange, JHvan der Neut, MABorst, AJYildirim, Mvan Stuivenberg, HHvan Vliet, BJKruse, CG Probing the cannabinoid CB1/CB2 receptor subtype selectivity limits of 1,2-diarylimidazole-4-carboxamides by fine-tuning their 5-substitution pattern. Bioorg Med Chem Lett20:2770-5 (2010) 
 
Cannabinoid receptor 1
Name:Cannabinoid receptor 1
Type:G Protein-Coupled Receptor (GPCR)
Mol. Mass.:52868.96
Organism:Homo sapiens (Human)
Description:P21554
Residue:472
BDBM50317251
NameBDBM50317251
Synonyms:1-(4-chlorophenyl)-2-(2,4-dichlorophenyl)-5-(methylthio)-N-(piperidin-1-yl)-1H-imidazole-4-carboxamide | CHEMBL1088221
TypeSmall organic molecule
Emp. Form.C22H21Cl3N4OS
Mol. Mass.495.852
SMILESCSc1c(nc(-c2ccc(Cl)cc2Cl)n1-c1ccc(Cl)cc1)C(=O)NN1CCCCC1