Reaction Details
TargetcGMP-specific 3',5'-cyclic phosphodiesterase
LigandBDBM50318144
Substrate/Competitorn/a
Meas. Tech.ChEMBL_632175 (CHEMBL1106508)
IC50 0.090000±n/a nM
Citation Tollefson, MBAcker, BAJacobsen, EJHughes, ROWalker, JKFox, DNPalmer, MJFreeman, SKYu, YBond, BR 1-(2-(2,2,2-trifluoroethoxy)ethyl-1H-pyrazolo[4,3-d]pyrimidines as potent phosphodiesterase 5 (PDE5) inhibitors. Bioorg Med Chem Lett20:3125-8 (2010) 
 
cGMP-specific 3',5'-cyclic phosphodiesterase
Name:cGMP-specific 3',5'-cyclic phosphodiesterase
Type:Protein
Mol. Mass.:99975.83
Organism:Homo sapiens (Human)
Description:O76074
Residue:875
BDBM50318144
NameBDBM50318144
Synonyms:3-ethyl-N-(4-fluorophenyl)-5-(piperazin-1-yl)-1-(2-(2,2,2-trifluoroethoxy)ethyl)-1H-pyrazolo[4,3-d]pyrimidin-7-amine | CHEMBL1095406
TypeSmall organic molecule
Emp. Form.C21H25F4N7O
Mol. Mass.467.4631
SMILESCCc1nn(CCOCC(F)(F)F)c2c(Nc3ccc(F)cc3)nc(nc12)N1CCNCC1