Reaction Details
TargetAromatase
LigandBDBM23419
Substrate/Competitorn/a
Meas. Tech.ChEMBL_630232 (CHEMBL1105634)
IC50 2.9±n/a nM
Citation Muftuoglu, YMustata, G Pharmacophore modeling strategies for the development of novel nonsteroidal inhibitors of human aromatase (CYP19). Bioorg Med Chem Lett20:3050-64 (2010) 
 
Aromatase
Name:Aromatase
Type:Enzyme
Mol. Mass.:57888.92
Organism:Homo sapiens (Human)
Description:P11511
Residue:503
BDBM23419
NameBDBM23419
Synonyms:(2S)-5,7-dihydroxy-2-(4-hydroxyphenyl)-3,4-dihydro-2H-1-benzopyran-4-one Naringenin
Typeflavanone
Emp. Form.C15H12O5
Mol. Mass.272.2528
SMILESOc1ccc(cc1)[C@@H]1CC(=O)c2c(O)cc(O)cc2O1