Reaction Details
TargetTransient receptor potential cation channel subfamily A member 1
LigandBDBM50318458
Substrate/Competitorn/a
Meas. Tech.ChEMBL_633031 (CHEMBL1118499)
IC50 51±n/a nM
Citation Baraldi, PGPreti, DMaterazzi, SGeppetti, P Transient receptor potential ankyrin 1 (TRPA1) channel as emerging target for novel analgesics and anti-inflammatory agents. J Med Chem53:5085-107 (2010) 
 
Transient receptor potential cation channel subfamily A member 1
Name:Transient receptor potential cation channel subfamily A member 1
Type:Protein
Mol. Mass.:127514.20
Organism:Homo sapiens (Human)
Description:O75762
Residue:1119
BDBM50318458
NameBDBM50318458
Synonyms:4-bromo-N-(2,2,2-trichloro-1-(4-chlorophenylthio)ethyl)benzamide CHEMBL1086588
TypeSmall organic molecule
Emp. Form.C15H10BrCl4NOS
Mol. Mass.474.027
SMILESClc1ccc(SC(NC(=O)c2ccc(Br)cc2)C(Cl)(Cl)Cl)cc1