Reaction Details
TargetTransient receptor potential cation channel subfamily A member 1
LigandBDBM50318460
Substrate/Competitorn/a
Meas. Tech.ChEMBL_633031 (CHEMBL1118499)
IC50 1100±n/a nM
Citation Baraldi, PGPreti, DMaterazzi, SGeppetti, P Transient receptor potential ankyrin 1 (TRPA1) channel as emerging target for novel analgesics and anti-inflammatory agents. J Med Chem53:5085-107 (2010) 
 
Transient receptor potential cation channel subfamily A member 1
Name:Transient receptor potential cation channel subfamily A member 1
Type:Protein
Mol. Mass.:127514.20
Organism:Homo sapiens (Human)
Description:O75762
Residue:1119
BDBM50318460
NameBDBM50318460
Synonyms:CHEMBL1085104 | S-2,2,2-trichloro-1-(4-chlorobenzamido)ethyl ethanethioate
TypeSmall organic molecule
Emp. Form.C11H9Cl4NO2S
Mol. Mass.361.072
SMILESCC(=O)SC(NC(=O)c1ccc(Cl)cc1)C(Cl)(Cl)Cl