Reaction Details
TargetTransient receptor potential cation channel subfamily A member 1
LigandBDBM50318461
Substrate/Competitorn/a
Meas. Tech.ChEMBL_633031 (CHEMBL1118499)
IC50 1400±n/a nM
Citation Baraldi, PGPreti, DMaterazzi, SGeppetti, P Transient receptor potential ankyrin 1 (TRPA1) channel as emerging target for novel analgesics and anti-inflammatory agents. J Med Chem53:5085-107 (2010) 
 
Transient receptor potential cation channel subfamily A member 1
Name:Transient receptor potential cation channel subfamily A member 1
Type:Protein
Mol. Mass.:127514.20
Organism:Homo sapiens (Human)
Description:O75762
Residue:1119
BDBM50318461
NameBDBM50318461
Synonyms:4-methyl-N-(2,2,2-trichloro-1-(4-chlorophenylthio)ethyl)benzamide | CHEMBL1084857
TypeSmall organic molecule
Emp. Form.C16H13Cl4NOS
Mol. Mass.409.158
SMILESCc1ccc(cc1)C(=O)NC(Sc1ccc(Cl)cc1)C(Cl)(Cl)Cl