Reaction Details
TargetTransient receptor potential cation channel subfamily A member 1
LigandBDBM50318462
Substrate/Competitorn/a
Meas. Tech.ChEMBL_633036 (CHEMBL1118736)
IC50 360±n/a nM
Citation Baraldi, PGPreti, DMaterazzi, SGeppetti, P Transient receptor potential ankyrin 1 (TRPA1) channel as emerging target for novel analgesics and anti-inflammatory agents. J Med Chem53:5085-107 (2010) 
 
Transient receptor potential cation channel subfamily A member 1
Name:Transient receptor potential cation channel subfamily A member 1
Type:Protein
Mol. Mass.:127514.20
Organism:Homo sapiens (Human)
Description:O75762
Residue:1119
BDBM50318462
NameBDBM50318462
Synonyms:4-methyl-N-(2,2,2-trichloro-1-(4-nitrophenylthio)ethyl)benzamide | CHEMBL1086589
TypeSmall organic molecule
Emp. Form.C16H13Cl3N2O3S
Mol. Mass.419.71
SMILESCc1ccc(cc1)C(=O)NC(Sc1ccc(cc1)[N+]([O-])=O)C(Cl)(Cl)Cl