Reaction Details
TargetTransient receptor potential cation channel subfamily A member 1
LigandBDBM34230
Substrate/Competitorn/a
Meas. Tech.ChEMBL_633017 (CHEMBL1118242)
EC50 24000±n/a nM
Citation Baraldi, PGPreti, DMaterazzi, SGeppetti, P Transient receptor potential ankyrin 1 (TRPA1) channel as emerging target for novel analgesics and anti-inflammatory agents. J Med Chem53:5085-107 (2010) 
 
Transient receptor potential cation channel subfamily A member 1
Name:Transient receptor potential cation channel subfamily A member 1
Type:Protein
Mol. Mass.:127514.20
Organism:Homo sapiens (Human)
Description:O75762
Residue:1119
BDBM34230
NameBDBM34230
Synonyms:(Z)-7-[(1R,2S)-2-[(E,3S)-3-hydroxyoct-1-enyl]-5-keto-cyclopent-3-en-1-yl]hept-5-enoic acid (Z)-7-[(1R,2S)-2-[(E,3S)-3-hydroxyoct-1-enyl]-5-oxocyclopent-3-en-1-yl]hept-5-enoic acid MLS000069589 SMR000058790 | cid_5280880
TypeSmall organic molecule
Emp. Form.C20H30O4
Mol. Mass.334.4498
SMILESCCCCC[C@H](O)C=C[C@H]1C=CC(=O)[C@@H]1C\C=C/CCCC(O)=O