Reaction Details
TargetTransient receptor potential cation channel subfamily A member 1
LigandBDBM50318482
Substrate/Competitorn/a
Meas. Tech.ChEMBL_633017 (CHEMBL1118242)
EC50 28400±n/a nM
Citation Baraldi, PGPreti, DMaterazzi, SGeppetti, P Transient receptor potential ankyrin 1 (TRPA1) channel as emerging target for novel analgesics and anti-inflammatory agents. J Med Chem53:5085-107 (2010) 
 
Transient receptor potential cation channel subfamily A member 1
Name:Transient receptor potential cation channel subfamily A member 1
Type:Protein
Mol. Mass.:127514.20
Organism:Homo sapiens (Human)
Description:O75762
Residue:1119
BDBM50318482
NameBDBM50318482
Synonyms:(-)-menthol MENTHOL l-menthol
TypeSmall organic molecule
Emp. Form.C10H20O
Mol. Mass.156.2652
SMILESCC(C)[C@@H]1CC[C@@H](C)C[C@H]1O